{"text_format":"1","workbook":"xlsx","n_sheets":5,"sheets":["Instructions","Auction Sheet","Labels","photo beta","Scratch Paper"],"not_rendered":{"charts":0,"images":8,"macros":1,"external_links":0,"defined_names":2,"comments":1,"pivot_tables":0},"unopened":[],"bounds":{"document_bytes":16777216,"sheet_cells":100000,"rows_first":2000,"rows_last":500,"rows_between":2000,"halvings":0,"cell_chars":16384,"cell_head_chars":4096},"cells_cut":0,"cells_raw":0,"read":"whole","date_system":"1900"}

{"sheet":"Instructions","index":0,"n_rows":0,"n_cols":0,"rows_kept":0,"cut":false,"hidden":false,"merged":[]}

{"sheet":"Auction Sheet","index":1,"n_rows":139,"n_cols":11,"rows_kept":139,"cut":false,"hidden":false,"merged":[[136,1,136,3],[138,1,138,3],[130,1,130,4],[131,1,131,4],[133,5,133,7],[134,1,134,3],[135,1,135,3],[125,1,125,4],[126,1,126,4],[127,1,127,4],[128,1,128,4],[129,1,129,4],[120,1,120,4],[121,1,121,4],[122,1,122,4],[123,1,123,4],[124,1,124,4],[115,1,115,4],[116,1,116,4],[117,1,117,4],[118,1,118,4],[119,1,119,4],[110,1,110,4],[111,1,111,4],[112,1,112,4],[113,1,113,4],[114,1,114,4],[27,5,27,7],[106,1,106,4],[107,1,107,4],[108,1,108,4],[109,1,109,4],[61,5,61,7],[62,1,62,3],[63,1,63,3],[64,1,64,3],[99,1,99,3],[66,1,66,3],[94,5,94,7],[95,1,95,3],[85,1,85,4],[86,1,86,4],[96,1,96,3],[97,1,97,3],[81,1,81,4],[82,1,82,4],[83,1,83,4],[84,1,84,4],[91,1,91,4],[92,1,92,4],[88,1,88,4],[87,1,87,4],[77,1,77,4],[89,1,89,4],[90,1,90,4],[76,1,76,4],[79,1,79,4],[80,1,80,4],[75,1,75,4],[74,1,74,4],[73,1,73,4],[72,1,72,4],[71,1,71,4],[70,1,70,4],[69,1,69,4],[68,1,68,4],[59,1,59,4],[58,1,58,4],[57,1,57,4],[56,1,56,4],[42,1,42,4],[41,1,41,4],[55,1,55,4],[54,1,54,4],[53,1,53,4],[52,1,52,4],[51,1,51,4],[67,1,67,4],[25,1,25,4],[39,1,39,4],[38,1,38,4],[37,1,37,4],[36,1,36,4],[43,1,43,4],[35,1,35,4],[40,1,40,4],[47,1,47,4],[46,1,46,4],[45,1,45,4],[44,1,44,4],[50,1,50,4],[49,1,49,4],[48,1,48,4],[14,1,14,4],[34,1,34,4],[13,1,13,4],[12,1,12,4],[11,1,11,4],[32,1,32,3],[24,1,24,4],[23,1,23,4],[29,1,29,3],[30,1,30,3],[28,1,28,3],[22,1,22,4],[21,1,21,4],[20,1,20,4],[19,1,19,4],[2,1,2,4],[1,1,1,4],[0,1,0,4],[78,1,78,4],[6,1,6,4],[5,1,5,4],[4,1,4,4],[3,1,3,4],[10,1,10,4],[9,1,9,4],[18,1,18,4],[17,1,17,4],[16,1,16,4],[15,1,15,4],[8,1,8,4],[7,1,7,4]]}
[" BAG #","DESCRIPTION OF ITEM",null,null,null,"MIN BID (Optional)","BUYER NUMBER","SELLING PRICE","Alternate Text"]
[{"$f":"+IF(ISBLANK(I2),CONCATENATE(B$28,\"-\",TEXT(K2,\"000\")),I2)","v":"-001"},null,null,null,null,null,null,null,null,null,1]
["-002",null,null,null,null,null,null,null,null,null,2]
["-003",null,null,null,null,null,null,null,null,null,3]
["-004",null,null,null,null,null,null,null,null,null,4]
["-005",null,null,null,null,null,null,null,null,null,5]
["-006",null,null,null,null,null,null,null,null,null,6]
["-007",null,null,null,null,null,null,null,null,null,7]
["-008",null,null,null,null,null,null,null,null,null,8]
["-009",null,null,null,null,null,null,null,null,null,9]
["-010",null,null,null,null,null,null,null,null,null,10]
["-011",null,null,null,null,null,null,null,null,null,11]
["-012",null,null,null,null,null,null,null,null,null,12]
["-013",null,null,null,null,null,null,null,null,null,13]
["-014",null,null,null,null,null,null,null,null,null,14]
["-015",null,null,null,null,null,null,null,null,null,15]
["-016",null,null,null,null,null,null,null,null,null,16]
["-017",null,null,null,null,null,null,null,null,null,17]
["-018",null,null,null,null,null,null,null,null,null,18]
["-019",null,null,null,null,null,null,null,null,null,19]
["-020",null,null,null,null,null,null,null,null,null,20]
["-021",null,null,null,null,null,null,null,null,null,21]
["-022",null,null,null,null,null,null,null,null,null,22]
["-023",null,null,null,null,null,null,null,null,null,23]
["-024",null,null,null,null,null,null,null,null,null,24]
["-025",null,null,null,null,null,null,null,null,null,25]
[]
["SELLER #",null,"PHONE:",null,null,"CLUB TREASURER"]
["SELLER NAME",null,null,null,null,"TOTAL"]
["ADDRESS",null,null,null,null,"Worker Bonus"]
["CITY",null,null,null,null,"Minus 30%"]
["State",null,"Zip"]
["E-Mail",null,null,null,null,"DUE SELLER"]
[]
[" BAG #","DESCRIPTION OF ITEM",null,null,null,"MIN BID (Optional)","BUYER NUMBER","SELLING PRICE","Alternate Text"]
[{"$f":"+IF(ISBLANK(I36),CONCATENATE(B$28,\"-\",TEXT(K36,\"000\")),I36)","v":"-026"},null,null,null,null,null,null,null,null,null,{"$f":"+K26+1","v":26}]
["-027",null,null,null,null,null,null,null,null,null,{"$f":"+K36+1","v":27}]
["-028",null,null,null,null,null,null,null,null,null,28]
["-029",null,null,null,null,null,null,null,null,null,29]
["-030",null,null,null,null,null,null,null,null,null,30]
{"$rows_left_out":100}
{"sheet":"Labels","index":2,"n_rows":450,"n_cols":6,"rows_kept":450,"cut":false,"hidden":false,"merged":[[0,0,1,0],[0,1,1,1],[0,3,1,3],[12,0,13,0],[12,1,13,1],[12,3,13,3],[0,4,1,4],[2,0,5,1],[2,3,5,4],[3,5,17,5],[6,0,7,0],[6,1,7,1],[6,3,7,3],[6,4,7,4],[10,0,10,1],[10,3,10,4],[12,4,13,4],[14,0,17,1],[14,3,17,4],[18,0,19,0],[18,1,19,1],[18,3,19,3],[18,4,19,4],[19,5,26,5],[22,0,22,1],[22,3,22,4],[24,0,25,0],[24,1,25,1],[24,3,25,3],[24,4,25,4],[26,0,29,1],[26,3,29,4],[30,4,31,4],[34,0,34,1],[34,3,34,4],[36,0,37,0],[36,1,37,1],[36,3,37,3],[36,4,37,4],[30,0,31,0],[30,1,31,1],[30,3,31,3],[38,0,41,1],[38,3,41,4],[42,0,43,0],[42,1,43,1],[42,3,43,3],[42,4,43,4],[46,0,46,1],[46,3,46,4],[48,0,49,0],[48,1,49,1],[48,3,49,3],[48,4,49,4],[50,0,53,1],[50,3,53,4],[54,0,55,0],[54,1,55,1],[54,3,55,3],[54,4,55,4],[58,0,58,1],[58,3,58,4],[59,0,60,0],[59,1,60,1],[59,3,60,3],[59,4,60,4],[61,0,64,1],[61,3,64,4],[65,0,66,0],[65,1,66,1],[65,3,66,3],[65,4,66,4],[69,0,69,1],[69,3,69,4],[71,0,72,0],[71,1,72,1],[71,3,72,3],[71,4,72,4],[73,0,76,1],[73,3,76,4],[77,0,78,0],[77,1,78,1],[77,3,78,3],[77,4,78,4],[81,0,81,1],[81,3,81,4],[83,0,84,0],[83,1,84,1],[83,3,84,3],[83,4,84,4],[85,0,88,1],[85,3,88,4],[89,0,90,0],[89,1,90,1],[89,3,90,3],[89,4,90,4],[93,0,93,1],[93,3,93,4],[95,0,96,0],[95,1,96,1],[95,3,96,3],[95,4,96,4],[97,0,100,1],[97,3,100,4],[101,0,102,0],[101,1,102,1],[101,3,102,3],[101,4,102,4],[105,0,105,1],[105,3,105,4],[107,0,108,0],[107,1,108,1],[107,3,108,3],[107,4,108,4],[109,0,112,1],[109,3,112,4],[113,0,114,0],[113,1,114,1],[113,3,114,3],[113,4,114,4],[117,0,117,1],[117,3,117,4],[118,0,119,0],[118,1,119,1],[118,3,119,3],[118,4,119,4],[120,0,123,1],[120,3,123,4],[124,0,125,0],[124,1,125,1],[124,3,125,3],[124,4,125,4],[128,0,128,1],[128,3,128,4],[130,0,131,0],[130,1,131,1],[130,3,131,3],[130,4,131,4],[132,0,135,1],[132,3,135,4],[136,0,137,0],[136,1,137,1],[136,3,137,3],[136,4,137,4],[140,0,140,1],[140,3,140,4],[142,0,143,0],[142,1,143,1],[142,3,143,3],[142,4,143,4],[144,0,147,1],[144,3,147,4],[148,0,149,0],[148,1,149,1],[148,3,149,3],[148,4,149,4],[152,0,152,1],[152,3,152,4],[154,0,155,0],[154,1,155,1],[154,3,155,3],[154,4,155,4],[156,0,159,1],[156,3,159,4],[160,0,161,0],[160,1,161,1],[160,3,161,3],[160,4,161,4],[164,0,164,1],[164,3,164,4],[166,0,167,0],[166,1,167,1],[166,3,167,3],[166,4,167,4],[168,0,171,1],[168,3,171,4],[172,0,173,0],[172,1,173,1],[172,3,173,3],[172,4,173,4],[176,0,176,1],[176,3,176,4],[177,0,178,0],[177,1,178,1],[177,3,178,3],[177,4,178,4],[179,0,182,1],[179,3,182,4],[183,0,184,0],[183,1,184,1],[183,3,184,3],[183,4,184,4],[187,0,187,1],[187,3,187,4],[189,0,190,0],[189,1,190,1],[189,3,190,3],[189,4,190,4],[191,0,194,1],[191,3,194,4],[195,0,196,0],[195,1,196,1],[195,3,196,3],[195,4,196,4],[199,0,199,1],[199,3,199,4],[201,0,202,0],[201,1,202,1],[201,3,202,3],[201,4,202,4],[203,0,206,1],[203,3,206,4],[207,0,208,0],[207,1,208,1],[207,3,208,3],[207,4,208,4],[211,0,211,1],[211,3,211,4],[213,0,214,0],[213,1,214,1],[213,3,214,3],[213,4,214,4],[215,0,218,1],[215,3,218,4],[219,0,220,0],[219,1,220,1],[219,3,220,3],[219,4,220,4],[223,0,223,1],[223,3,223,4],[225,0,226,0],[225,1,226,1],[225,3,226,3],[225,4,226,4],[227,0,230,1],[227,3,230,4],[231,0,232,0],[231,1,232,1],[231,3,232,3],[231,4,232,4],[235,0,235,1],[235,3,235,4],[236,0,237,0],[236,1,237,1],[236,3,237,3],[236,4,237,4],[238,0,241,1],[238,3,241,4],[242,0,243,0],[242,1,243,1],[242,3,243,3],[242,4,243,4],[246,0,246,1],[246,3,246,4],[248,0,249,0],[248,1,249,1],[248,3,249,3],[248,4,249,4],[250,0,253,1],[250,3,253,4],[254,0,255,0],[254,1,255,1],[254,3,255,3],[254,4,255,4],[258,0,258,1],[258,3,258,4],[260,0,261,0],[260,1,261,1],[260,3,261,3],[260,4,261,4],[262,0,265,1],[262,3,265,4],[266,0,267,0],[266,1,267,1],[266,3,267,3],[266,4,267,4],[270,0,270,1],[270,3,270,4],[272,0,273,0],[272,1,273,1],[272,3,273,3],[272,4,273,4],[274,0,277,1],[274,3,277,4],[278,0,279,0],[278,1,279,1],[278,3,279,3],[278,4,279,4],[282,0,282,1],[282,3,282,4],[284,0,285,0],[284,1,285,1],[284,3,285,3],[284,4,285,4],[286,0,289,1],[286,3,289,4],[290,0,291,0],[290,1,291,1],[290,3,291,3],[290,4,291,4],[294,0,294,1],[294,3,294,4],[295,0,296,0],[295,1,296,1],[295,3,296,3],[295,4,296,4],[297,0,300,1],[297,3,300,4],[301,0,302,0],[301,1,302,1],[301,3,302,3],[301,4,302,4],[305,0,305,1],[305,3,305,4],[307,0,308,0],[307,1,308,1],[307,3,308,3],[307,4,308,4],[309,0,312,1],[309,3,312,4],[313,0,314,0],[313,1,314,1],[313,3,314,3],[313,4,314,4],[317,0,317,1],[317,3,317,4],[319,0,320,0],[319,1,320,1],[319,3,320,3],[319,4,320,4],[321,0,324,1],[321,3,324,4],[325,0,326,0],[325,1,326,1],[325,3,326,3],[325,4,326,4],[329,0,329,1],[329,3,329,4],[331,0,332,0],[331,1,332,1],[331,3,332,3],[331,4,332,4],[333,0,336,1],[333,3,336,4],[337,0,338,0],[337,1,338,1],[337,3,338,3],[337,4,338,4],[341,0,341,1],[341,3,341,4],[343,0,344,0],[343,1,344,1],[343,3,344,3],[343,4,344,4],[345,0,348,1],[345,3,348,4],[349,0,350,0],[349,1,350,1],[349,3,350,3],[349,4,350,4],[353,0,353,1],[353,3,353,4],[354,0,355,0],[354,1,355,1],[354,3,355,3],[354,4,355,4],[356,0,359,1],[356,3,359,4],[360,0,361,0],[360,1,361,1],[360,3,361,3],[360,4,361,4],[364,0,364,1],[364,3,364,4],[366,0,367,0],[366,1,367,1],[366,3,367,3],[366,4,367,4],[368,0,371,1],[368,3,371,4],[372,0,373,0],[372,1,373,1],[372,3,373,3],[372,4,373,4],[376,0,376,1],[376,3,376,4],[378,0,379,0],[378,1,379,1],[378,3,379,3],[378,4,379,4],[380,0,383,1],[380,3,383,4],[384,0,385,0],[384,1,385,1],[384,3,385,3],[384,4,385,4],[388,0,388,1],[388,3,388,4],[390,0,391,0],[390,1,391,1],[390,3,391,3],[390,4,391,4],[389,0,389,1],[392,0,395,1],[392,3,395,4],[396,0,397,0],[396,1,397,1],[396,3,397,3],[396,4,397,4],[400,0,400,1],[400,3,400,4],[402,0,403,0],[402,1,403,1],[402,3,403,3],[402,4,403,4],[404,0,407,1],[404,3,407,4],[408,0,409,0],[408,1,409,1],[408,3,409,3],[408,4,409,4],[412,0,412,1],[412,3,412,4],[413,0,414,0],[413,1,414,1],[413,3,414,3],[413,4,414,4],[415,0,418,1],[415,3,418,4],[419,0,420,0],[419,1,420,1],[419,3,420,3],[419,4,420,4],[423,0,423,1],[423,3,423,4],[425,0,426,0],[425,1,426,1],[425,3,426,3],[425,4,426,4],[427,0,430,1],[427,3,430,4],[431,0,432,0],[431,1,432,1],[431,3,432,3],[431,4,432,4],[435,0,435,1],[435,3,435,4],[437,0,438,0],[437,1,438,1],[437,3,438,3],[437,4,438,4],[446,3,446,4],[447,0,447,1],[447,3,447,4],[439,0,442,1],[439,3,442,4],[443,0,444,0],[443,1,444,1],[443,3,444,3],[443,4,444,4]]}
["BAG#",{"$f":"+'Auction Sheet'!$A2","v":"-001"},null,"BAG#",{"$f":"+'Auction Sheet'!$A3","v":"-002"}]
[]
[{"$f":"+'Auction Sheet'!$B2","v":0},null,null,{"$f":"+'Auction Sheet'!$B3","v":0}]
[null,null,null,null,null,"PRINT ONLY FROM WHITE AREA TO LEFT"]
[]
[]
[{"$f":"IF(ISNUMBER($B7),\"MINIMUM BID\",\"\")","v":""},{"$f":"IF('Auction Sheet'!$F2>0,'Auction Sheet'!$F2,\"\")","v":""},null,{"$f":"IF(ISNUMBER($E7),\"MINIMUM BID\",\"\")","v":""},{"$f":"IF('Auction Sheet'!$F3>0,'Auction Sheet'!$F3,\"\")","v":""}]
[]
["Seller:",null,null,"Seller:"]
[{"$f":"+'Auction Sheet'!$B$29","v":0},{"$f":"+'Auction Sheet'!$B$33","v":0},null,{"$f":"+'Auction Sheet'!$B$29","v":0},{"$f":"+'Auction Sheet'!$B$33","v":0}]
["Visit www.circlecityaqclub.org for all your auction labels!",null,null,"Visit www.circlecityaqclub.org for all your auction labels!"]
[]
["BAG#",{"$f":"+'Auction Sheet'!$A4","v":"-003"},null,"BAG#",{"$f":"+'Auction Sheet'!$A5","v":"-004"}]
[]
[{"$f":"+'Auction Sheet'!$B4","v":0},null,null,{"$f":"+'Auction Sheet'!$B5","v":0}]
[]
[]
[]
[{"$f":"IF(ISNUMBER($B19),\"MINIMUM BID\",\"\")","v":""},{"$f":"IF('Auction Sheet'!$F4>0,'Auction Sheet'!$F4,\"\")","v":""},null,{"$f":"IF(ISNUMBER($E19),\"MINIMUM BID\",\"\")","v":""},{"$f":"IF('Auction Sheet'!$F5>0,'Auction Sheet'!$F5,\"\")","v":""}]
[null,null,null,null,null,"USES AVERY 5163 2x4"]
["Seller:",null,null,"Seller:"]
[{"$f":"+'Auction Sheet'!$B$29","v":0},{"$f":"+'Auction Sheet'!$B$33","v":0},null,{"$f":"+'Auction Sheet'!$B$29","v":0},{"$f":"+'Auction Sheet'!$B$33","v":0}]
["Visit www.circlecityaqclub.org for all your auction labels!",null,null,"Visit www.circlecityaqclub.org for all your auction labels!"]
[]
["BAG#",{"$f":"+'Auction Sheet'!$A6","v":"-005"},null,"BAG#",{"$f":"+'Auction Sheet'!$A7","v":"-006"}]
[]
[{"$f":"+'Auction Sheet'!$B6","v":0},null,null,{"$f":"+'Auction Sheet'!$B7","v":0}]
[]
[]
[]
[{"$f":"IF(ISNUMBER($B31),\"MINIMUM BID\",\"\")","v":""},{"$f":"IF('Auction Sheet'!$F6>0,'Auction Sheet'!$F6,\"\")","v":""},null,{"$f":"IF(ISNUMBER($E31),\"MINIMUM BID\",\"\")","v":""},{"$f":"IF('Auction Sheet'!$F7>0,'Auction Sheet'!$F7,\"\")","v":""}]
[]
["Seller:",null,null,"Seller:"]
[{"$f":"+'Auction Sheet'!$B$29","v":0},{"$f":"+'Auction Sheet'!$B$33","v":0},null,{"$f":"+'Auction Sheet'!$B$29","v":0},{"$f":"+'Auction Sheet'!$B$33","v":0}]
["Visit www.circlecityaqclub.org for all your auction labels!",null,null,"Visit www.circlecityaqclub.org for all your auction labels!"]
[]
["BAG#",{"$f":"+'Auction Sheet'!$A8","v":"-007"},null,"BAG#",{"$f":"+'Auction Sheet'!$A9","v":"-008"}]
[]
[{"$f":"+'Auction Sheet'!$B8","v":0},null,null,{"$f":"+'Auction Sheet'!$B9","v":0}]
[]
{"$rows_left_out":411}
{"sheet":"photo beta","index":3,"n_rows":450,"n_cols":6,"rows_kept":450,"cut":false,"hidden":true,"merged":[[447,0,447,1],[447,3,447,4],[439,0,442,1],[439,3,442,4],[443,0,444,0],[443,1,444,1],[443,3,444,3],[443,4,444,4],[435,0,435,1],[435,3,435,4],[437,0,438,0],[437,1,438,1],[437,3,438,3],[437,4,438,4],[427,0,430,1],[427,3,430,4],[431,0,432,0],[431,1,432,1],[431,3,432,3],[431,4,432,4],[423,0,423,1],[423,3,423,4],[425,0,426,0],[425,1,426,1],[425,3,426,3],[425,4,426,4],[415,0,418,1],[415,3,418,4],[419,0,420,0],[419,1,420,1],[419,3,420,3],[419,4,420,4],[412,0,412,1],[412,3,412,4],[413,0,414,0],[413,1,414,1],[413,3,414,3],[413,4,414,4],[404,0,407,1],[404,3,407,4],[408,0,409,0],[408,1,409,1],[408,3,409,3],[408,4,409,4],[400,0,400,1],[400,3,400,4],[402,0,403,0],[402,1,403,1],[402,3,403,3],[402,4,403,4],[392,0,395,1],[392,3,395,4],[396,0,397,0],[396,1,397,1],[396,3,397,3],[396,4,397,4],[388,0,388,1],[388,3,388,4],[390,0,391,0],[390,1,391,1],[390,3,391,3],[390,4,391,4],[380,0,383,1],[380,3,383,4],[384,0,385,0],[384,1,385,1],[384,3,385,3],[384,4,385,4],[376,0,376,1],[376,3,376,4],[378,0,379,0],[378,1,379,1],[378,3,379,3],[378,4,379,4],[368,0,371,1],[368,3,371,4],[372,0,373,0],[372,1,373,1],[372,3,373,3],[372,4,373,4],[364,0,364,1],[364,3,364,4],[366,0,367,0],[366,1,367,1],[366,3,367,3],[366,4,367,4],[356,0,359,1],[356,3,359,4],[360,0,361,0],[360,1,361,1],[360,3,361,3],[360,4,361,4],[353,0,353,1],[353,3,353,4],[354,0,355,0],[354,1,355,1],[354,3,355,3],[354,4,355,4],[345,0,348,1],[345,3,348,4],[349,0,350,0],[349,1,350,1],[349,3,350,3],[349,4,350,4],[341,0,341,1],[341,3,341,4],[343,0,344,0],[343,1,344,1],[343,3,344,3],[343,4,344,4],[333,0,336,1],[333,3,336,4],[337,0,338,0],[337,1,338,1],[337,3,338,3],[337,4,338,4],[329,0,329,1],[329,3,329,4],[331,0,332,0],[331,1,332,1],[331,3,332,3],[331,4,332,4],[321,0,324,1],[321,3,324,4],[325,0,326,0],[325,1,326,1],[325,3,326,3],[325,4,326,4],[317,0,317,1],[317,3,317,4],[319,0,320,0],[319,1,320,1],[319,3,320,3],[319,4,320,4],[309,0,312,1],[309,3,312,4],[313,0,314,0],[313,1,314,1],[313,3,314,3],[313,4,314,4],[305,0,305,1],[305,3,305,4],[307,0,308,0],[307,1,308,1],[307,3,308,3],[307,4,308,4],[297,0,300,1],[297,3,300,4],[301,0,302,0],[301,1,302,1],[301,3,302,3],[301,4,302,4],[294,0,294,1],[294,3,294,4],[295,0,296,0],[295,1,296,1],[295,3,296,3],[295,4,296,4],[286,0,289,1],[286,3,289,4],[290,0,291,0],[290,1,291,1],[290,3,291,3],[290,4,291,4],[282,0,282,1],[282,3,282,4],[284,0,285,0],[284,1,285,1],[284,3,285,3],[284,4,285,4],[274,0,277,1],[274,3,277,4],[278,0,279,0],[278,1,279,1],[278,3,279,3],[278,4,279,4],[270,0,270,1],[270,3,270,4],[272,0,273,0],[272,1,273,1],[272,3,273,3],[272,4,273,4],[262,0,265,1],[262,3,265,4],[266,0,267,0],[266,1,267,1],[266,3,267,3],[266,4,267,4],[258,0,258,1],[258,3,258,4],[260,0,261,0],[260,1,261,1],[260,3,261,3],[260,4,261,4],[250,0,253,1],[250,3,253,4],[254,0,255,0],[254,1,255,1],[254,3,255,3],[254,4,255,4],[246,0,246,1],[246,3,246,4],[248,0,249,0],[248,1,249,1],[248,3,249,3],[248,4,249,4],[238,0,241,1],[238,3,241,4],[242,0,243,0],[242,1,243,1],[242,3,243,3],[242,4,243,4],[235,0,235,1],[235,3,235,4],[236,0,237,0],[236,1,237,1],[236,3,237,3],[236,4,237,4],[227,0,230,1],[227,3,230,4],[231,0,232,0],[231,1,232,1],[231,3,232,3],[231,4,232,4],[223,0,223,1],[223,3,223,4],[225,0,226,0],[225,1,226,1],[225,3,226,3],[225,4,226,4],[215,0,218,1],[215,3,218,4],[219,0,220,0],[219,1,220,1],[219,3,220,3],[219,4,220,4],[211,0,211,1],[211,3,211,4],[213,0,214,0],[213,1,214,1],[213,3,214,3],[213,4,214,4],[203,0,206,1],[203,3,206,4],[207,0,208,0],[207,1,208,1],[207,3,208,3],[207,4,208,4],[199,0,199,1],[199,3,199,4],[201,0,202,0],[201,1,202,1],[201,3,202,3],[201,4,202,4],[191,0,194,1],[191,3,194,4],[195,0,196,0],[195,1,196,1],[195,3,196,3],[195,4,196,4],[187,0,187,1],[187,3,187,4],[189,0,190,0],[189,1,190,1],[189,3,190,3],[189,4,190,4],[179,0,182,1],[179,3,182,4],[183,0,184,0],[183,1,184,1],[183,3,184,3],[183,4,184,4],[176,0,176,1],[176,3,176,4],[177,0,178,0],[177,1,178,1],[177,3,178,3],[177,4,178,4],[168,0,171,1],[168,3,171,4],[172,0,173,0],[172,1,173,1],[172,3,173,3],[172,4,173,4],[164,0,164,1],[164,3,164,4],[166,0,167,0],[166,1,167,1],[166,3,167,3],[166,4,167,4],[156,0,159,1],[156,3,159,4],[160,0,161,0],[160,1,161,1],[160,3,161,3],[160,4,161,4],[152,0,152,1],[152,3,152,4],[154,0,155,0],[154,1,155,1],[154,3,155,3],[154,4,155,4],[144,0,147,1],[144,3,147,4],[148,0,149,0],[148,1,149,1],[148,3,149,3],[148,4,149,4],[140,0,140,1],[140,3,140,4],[142,0,143,0],[142,1,143,1],[142,3,143,3],[142,4,143,4],[132,0,135,1],[132,3,135,4],[136,0,137,0],[136,1,137,1],[136,3,137,3],[136,4,137,4],[128,0,128,1],[128,3,128,4],[130,0,131,0],[130,1,131,1],[130,3,131,3],[130,4,131,4],[120,0,123,1],[120,3,123,4],[124,0,125,0],[124,1,125,1],[124,3,125,3],[124,4,125,4],[117,0,117,1],[117,3,117,4],[118,0,119,0],[118,1,119,1],[118,3,119,3],[118,4,119,4],[109,0,112,1],[109,3,112,4],[113,0,114,0],[113,1,114,1],[113,3,114,3],[113,4,114,4],[105,0,105,1],[105,3,105,4],[107,0,108,0],[107,1,108,1],[107,3,108,3],[107,4,108,4],[97,0,100,1],[97,3,100,4],[101,0,102,0],[101,1,102,1],[101,3,102,3],[101,4,102,4],[93,0,93,1],[93,3,93,4],[95,0,96,0],[95,1,96,1],[95,3,96,3],[95,4,96,4],[85,0,88,1],[85,3,88,4],[89,0,90,0],[89,1,90,1],[89,3,90,3],[89,4,90,4],[81,0,81,1],[81,3,81,4],[83,0,84,0],[83,1,84,1],[83,3,84,3],[83,4,84,4],[73,0,76,1],[73,3,76,4],[77,0,78,0],[77,1,78,1],[77,3,78,3],[77,4,78,4],[69,0,69,1],[69,3,69,4],[71,0,72,0],[71,1,72,1],[71,3,72,3],[71,4,72,4],[61,0,64,1],[61,3,64,4],[65,0,66,0],[65,1,66,1],[65,3,66,3],[65,4,66,4],[58,0,58,1],[58,3,58,4],[59,0,60,0],[59,1,60,1],[59,3,60,3],[59,4,60,4],[50,0,53,1],[50,3,53,4],[54,0,55,0],[54,1,55,1],[54,3,55,3],[54,4,55,4],[46,0,46,1],[46,3,46,4],[48,0,49,0],[48,1,49,1],[48,3,49,3],[48,4,49,4],[38,0,41,1],[38,3,41,4],[42,0,43,0],[42,1,43,1],[42,3,43,3],[42,4,43,4],[34,0,34,1],[34,3,34,4],[36,0,37,0],[36,1,37,1],[36,3,37,3],[36,4,37,4],[30,0,31,0],[30,1,31,1],[30,3,31,3],[30,4,31,4],[19,5,26,5],[22,0,22,1],[22,3,22,4],[24,0,25,0],[24,1,25,1],[24,3,25,3],[24,4,25,4],[26,0,29,1],[26,3,29,4],[18,0,19,0],[18,1,19,1],[18,3,19,3],[18,4,19,4],[10,3,10,4],[12,0,13,0],[12,1,13,1],[12,3,13,3],[12,4,13,4],[14,0,17,1],[14,3,17,4],[0,0,1,0],[0,1,1,1],[0,3,1,3],[0,4,1,4],[3,5,17,5],[6,0,7,0],[6,1,7,1],[6,3,7,3],[6,4,7,4],[10,0,10,1],[2,0,5,1],[2,3,5,4]]}
[{"$f":"Labels!A1","v":"BAG#"},{"$f":"Labels!B1","v":"-001"},null,{"$f":"Labels!D1","v":"BAG#"},{"$f":"Labels!E1","v":"-002"}]
[]
[{"$f":"Labels!A3","v":0},null,null,{"$f":"Labels!D3","v":0}]
[null,null,null,null,null,"PRINT ONLY FROM WHITE AREA TO LEFT"]
[]
[]
[{"$f":"Labels!A7","v":""},{"$f":"Labels!B7","v":""},null,{"$f":"Labels!D7","v":""},{"$f":"Labels!E7","v":""}]
[]
["Seller:",null,null,"Seller:"]
[{"$f":"Labels!A10","v":0},{"$f":"Labels!B10","v":0},null,{"$f":"Labels!D10","v":0},{"$f":"Labels!E10","v":0}]
["Visit www.circlecityaqclub.org for all your auction labels!",null,null,"Visit www.circlecityaqclub.org for all your auction labels!"]
[]
[{"$f":"Labels!A13","v":"BAG#"},{"$f":"Labels!B13","v":"-003"},null,{"$f":"Labels!D13","v":"BAG#"},{"$f":"Labels!E13","v":"-004"}]
[]
[{"$f":"Labels!A15","v":0},null,null,{"$f":"Labels!D15","v":0}]
[]
[]
[]
[{"$f":"Labels!A19","v":""},{"$f":"Labels!B19","v":""},null,{"$f":"Labels!D19","v":""},{"$f":"Labels!E19","v":""}]
[null,null,null,null,null,"USES AVERY 5163 2x4"]
["Seller:",null,null,"Seller:"]
[{"$f":"Labels!A22","v":0},{"$f":"Labels!B22","v":0},null,{"$f":"Labels!D22","v":0},{"$f":"Labels!E22","v":0}]
["Visit www.circlecityaqclub.org for all your auction labels!",null,null,"Visit www.circlecityaqclub.org for all your auction labels!"]
[]
[{"$f":"Labels!A25","v":"BAG#"},{"$f":"Labels!B25","v":"-005"},null,{"$f":"Labels!D25","v":"BAG#"},{"$f":"Labels!E25","v":"-006"}]
[]
[{"$f":"Labels!A27","v":0},null,null,{"$f":"Labels!D27","v":0}]
[]
[]
[]
[{"$f":"Labels!A31","v":""},{"$f":"Labels!B31","v":""},null,{"$f":"Labels!D31","v":""},{"$f":"Labels!E31","v":""}]
[]
["Seller:",null,null,"Seller:"]
[{"$f":"Labels!A34","v":0},{"$f":"Labels!B34","v":0},null,{"$f":"Labels!D34","v":0},{"$f":"Labels!E34","v":0}]
["Visit www.circlecityaqclub.org for all your auction labels!",null,null,"Visit www.circlecityaqclub.org for all your auction labels!"]
[]
[{"$f":"Labels!A37","v":"BAG#"},{"$f":"Labels!B37","v":"-007"},null,{"$f":"Labels!D37","v":"BAG#"},{"$f":"Labels!E37","v":"-008"}]
[]
[{"$f":"Labels!A39","v":0},null,null,{"$f":"Labels!D39","v":0}]
[]
{"$rows_left_out":411}
{"sheet":"Scratch Paper","index":4,"n_rows":6,"n_cols":2,"rows_kept":6,"cut":false,"hidden":false,"merged":[[26,1,26,4],[2,1,2,7],[3,1,3,7],[4,1,4,7],[5,1,5,7],[20,1,20,4],[21,1,21,4],[22,1,22,4],[23,1,23,4],[24,1,24,4],[25,1,25,4]]}
[]
[]
[null,"Use this sheet to copy in your images and resize them. "]
[null,"Copy the resized images and paste them into the labels on the label sheet."]
[null,"Do not cover any important printed information.  By adding a "]
[null,"picture, you take responsibility for anything not visible on the label."]